[ruby-cvs:69760] k0kubun:r62590 (trunk): tool/ruby_vm/helpers/dumper.rb: check ERB version

k0kubun at ruby-lang.org k0kubun at ruby-lang.org
Mon Feb 26 23:42:39 JST 2018


k0kubun	2018-02-26 23:42:39 +0900 (Mon, 26 Feb 2018)

  New Revision: 62590

  https://svn.ruby-lang.org/cgi-bin/viewvc.cgi?view=revision&revision=62590

  Log:
    tool/ruby_vm/helpers/dumper.rb: check ERB version
    
    I could not `make` trunk (62585) without this patch.
    
    ```
    $ make -j4 && make install
            BASERUBY = /home/pocke/.rbenv/shims/ruby --disable=gems
            CC = gcc
            LD = ld
            LDSHARED = gcc -shared
            CFLAGS = -O3 -ggdb3 -Wall -Wextra -Wno-unused-parameter -Wno-parentheses -Wno-long-long -Wno-missing-field-initializers -Wno-tautological-compare -Wno-parentheses-equality -Wno-constant-logical-operand -Wno-self-assign -Wunused-variable -Werror=implicit-int -Werror=pointer-arith -Werror=write-strings -Werror=declaration-after-statement -Werror=implicit-function-declaration -Werror=deprecated-declarations -Werror=misleading-indentation -Wno-overlength-strings -Wno-packed-bitfield-compat -Wsuggest-attribute=noreturn -Wsuggest-attribute=format -Wmissing-noreturn -Wimplicit-fallthrough=0 -Werror=duplicated-cond -Werror=restrict -std=gnu99  -fPIC
            XCFLAGS = -D_FORTIFY_SOURCE=2 -fstack-protector -fno-strict-overflow -DRUBY_DEVEL=1 -fvisibility=hidden -fexcess-precision=standard -DRUBY_EXPORT
            CPPFLAGS =   -I. -I.ext/include/x86_64-linux -I./include -I. -I./enc/unicode/10.0.0
            DLDFLAGS = -Wl,--compress-debug-sections=zlib -Wl,-soname,libruby.so.2.6  -fstack-protector
            SOLIBS = -lpthread -lgmp -ldl -lcrypt -lm
            LANG = en_GB.UTF-8
            LC_ALL =
            LC_CTYPE =
    gcc (GCC) 7.3.0
    Copyright (C) 2017 Free Software Foundation, Inc.
    This is free software; see the source for copying conditions.  There is NO
    warranty; not even for MERCHANTABILITY or FITNESS FOR A PARTICULAR PURPOSE.
    
    generating opt_sc.inc
    generating optunifs.inc
    generating insns.inc
    generating insns_info.inc
    Traceback (most recent call last):
            6: from ./tool/insns2vm.rb:9:in `<main>'
            5: from ./tool/insns2vm.rb:9:in `each'
            4: from ./tool/insns2vm.rb:10:in `block in <main>'
            3: from /home/pocke/ghq/github.com/ruby/ruby/tool/ruby_vm/helpers/dumper.rb:98:in `generate'
            2: from /home/pocke/ghq/github.com/ruby/ruby/tool/ruby_vm/helpers/dumper.rb:76:in `do_render'
            1: from /home/pocke/.rbenv/versions/trunk/lib/ruby/2.6.0/erb.rb:873:in `result'
    /home/pocke/.rbenv/versions/trunk/lib/ruby/2.6.0/erb.rb:869:in `block in result': no implicit conversion of Hash into Integer (TypeError)
    make: *** [Makefile:534: opt_sc.inc] Error 1
    make: *** Waiting for unfinished jobs....
    Traceback (most recent call last):
            6: from ./tool/insns2vm.rb:9:in `<main>'
            5: from ./tool/insns2vm.rb:9:in `each'
            4: from ./tool/insns2vm.rb:10:in `block in <main>'
            3: from /home/pocke/ghq/github.com/ruby/ruby/tool/ruby_vm/helpers/dumper.rb:98:in `generate'
            2: from /home/pocke/ghq/github.com/ruby/ruby/tool/ruby_vm/helpers/dumper.rb:76:in `do_render'
            1: from /home/pocke/.rbenv/versions/trunk/lib/ruby/2.6.0/erb.rb:873:in `result'
    /home/pocke/.rbenv/versions/trunk/lib/ruby/2.6.0/erb.rb:869:in `block in result': no implicit conversion of Hash into Integer (TypeError)
    make: *** [Makefile:534: optunifs.inc] Error 1
    Traceback (most recent call last):
            6: from ./tool/insns2vm.rb:9:in `<main>'
            5: from ./tool/insns2vm.rb:9:in `each'
            4: from ./tool/insns2vm.rb:10:in `block in <main>'
            3: from /home/pocke/ghq/github.com/ruby/ruby/tool/ruby_vm/helpers/dumper.rb:98:in `generate'
            2: from /home/pocke/ghq/github.com/ruby/ruby/tool/ruby_vm/helpers/dumper.rb:76:in `do_render'
            1: from /home/pocke/.rbenv/versions/trunk/lib/ruby/2.6.0/erb.rb:873:in `result'
    /home/pocke/.rbenv/versions/trunk/lib/ruby/2.6.0/erb.rb:869:in `block in result': no implicit conversion of Hash into Integer (TypeError)
    Traceback (most recent call last):
            6: from ./tool/insns2vm.rb:9:in `<main>'
            5: from ./tool/insns2vm.rb:9:in `each'
            4: from ./tool/insns2vm.rb:10:in `block in <main>'
            3: from /home/pocke/ghq/github.com/ruby/ruby/tool/ruby_vm/helpers/dumper.rb:98:in `generate'
            2: from /home/pocke/ghq/github.com/ruby/ruby/tool/ruby_vm/helpers/dumper.rb:76:in `do_render'
            1: from /home/pocke/.rbenv/versions/trunk/lib/ruby/2.6.0/erb.rb:873:in `result'
    /home/pocke/.rbenv/versions/trunk/lib/ruby/2.6.0/erb.rb:869:in `block in result': no implicit conversion of Hash into Integer (TypeError)
    make: *** [Makefile:534: insns.inc] Error 1
    make: *** [Makefile:534: insns_info.inc] Error 1
    ```
    
    I guess this issue is same as https://bugs.ruby-lang.org/projects/ruby-trunk/repository/revisions/62531
    So I applied the same change to tool/ruby_vm/helpers/dumper.rb also.
    
    close https://github.com/ruby/ruby/pull/1826
    
    Co-authored-by: Masataka Pocke Kuwabara <kuwabara at pocke.me>

  Modified files:
    trunk/tool/ruby_vm/helpers/dumper.rb


More information about the ruby-cvs mailing list